How To Fix Windows Installer Installation Wrapper Error 1642 Tutorial

Home > Windows Installer > Windows Installer Installation Wrapper Error 1642

Windows Installer Installation Wrapper Error 1642

Contents

Supersnake View Public Profile Find all posts by Supersnake (#6) Mufflore Ancient Guru Videocard: 980ti @1460 Processor: 6700K @4.6GHz Mainboard: Maximus VIII Hero Memory: 16GB LPX 3000 @3600 Answered 07/26/2006 by: bkelly Please log in to comment Please log in to comment Answer this question or Comment on this question for clarity AnswerSubmit Don't be a Stranger! System error: [3] 1155: File [1] not found 1259: This error code only occurs when using Windows Installer version 2.0... 1301: Cannot create the file '[2]'. Verify that the program to be upgraded exists on your computer and that you have the correct upgrade. (clientsetup.cpp:CCrmClientSetup::CopyInstallerFiles:982). 11:36:39| Error| Setup cannot proceed because an error occured while copying his comment is here

Please upgrade to a supported browser.DismissFileEditViewToolsHelpAccessibilityDebugSee new changesAccessibilityView onlyToggle screen reader support Reply > Olaf Revell Works For Tisski in London LinkedIn My Badges Verified Answer Olaf Revell responded on 10 Mar 2015 6:28 AM This Fixed the Issue for me. 1. Verify that you have suff... 1924: Could not update environment variable '[2]'. Yes No Additional feedback? 1500 characters remaining Submit Skip this Thank you! http://forums.guru3d.com/showthread.php?t=299764

Msi Error Code 1603

Yes, my password is: Forgot your password? Sign up for free! Please select another. 1314: The specified path '[2]' is unavailable. 1315: Unable to write to the specified folder: [2]. 1316: A network error occurred while attempting to read from the file: ERROR_INSTALL_SUSPEND1604Installation suspended, incomplete.

I bought Crysis on steam so it updates automatically. but ensure you have Reg Backups... Expected product version 2749: "Transform [2] invalid for package [3]. Windows Installer Error 1619 Reply Kamakshi Parate My Badges Suggested Answer Kamakshi Parate responded on 7 Feb 2015 7:14 PM Hello Ken, Please confirm Outlook bit version.

Tab... 2254: Database: [2] Transform: Cannot update row that does not exist. System error: [3]. 2266: Could not rollback storage. Verify that the shortcut file exists a... 1911: Could not register type library for file [2]. http://prajwaldesai.com/community/threads/error-1642-when-deploying-to-clients.288/ Download a new copy of the MSI file from www.microsoft.com/.../details.aspx 3.

Contact your technical su... 1715: Installed [2]. 1716: Configured [2]. 1717: Removed [2]. 1718: File [2] was rejected by digital signature policy. 1719: Windows Installer service could not be accessed. Windows Installer Returned 1613 Vmware That rules out an issue with the patch. In most cases you can't just install a regular patch over a Steam version of a game - you have to wait for Steam to release the update/patch, too. Thank you.

Windows Installer Error Codes

Contact your application vendor. Hope this helps. Msi Error Code 1603 Click OK twice. 9. Msi Error Codes And why should I not add to the thread?

Use the wizard! this content Reply Ken43708new My Badges Ken43708new responded on 2 Feb 2015 12:05 PM Not yet. Merge: The column count differed in the '[3]' table of... 2270: Database: [2]. Table... 2255: Database: [2] Transform: Column with this name already exists. Msi Motherboard Error Codes

System error: [2]. 2107: Error [3] registering type library [2]. 2108: Error [3] unregistering type library [2]. 2109: Section missing for .ini action. 2110: Key missing for .ini action. 2111: Detection Verify that you... 1918: Error installing ODBC driver: [4], ODBC error [2]: [3]. Regards, Kamakshi Microsoft Dynamics™ CRM Support Engineer Reply Ken43708new My Badges Ken43708new responded on 5 Mar 2015 11:39 AM Kamakshi - I'm still getting the following error information in the LOG weblink Reply Dan Meindertsma Works For McGladrey in Chicago, Illinois - USA Dan Meindertsma responded on 8 Apr 2015 8:17 AM Olaf's suggestion solved this issue for me - using a different

No action is taken. 2802: No publisher is found for the event [2]. 2803: Dialog View did not find a record for the dialog [2]. 2804: On activation of the control Windows Installer Returned 1639 Good luck. Thanks, Legendary724 Jedi2016 Jul 7, 2008 #2 I didn't have any problems with it.

If your CRM server is in version v6 i.e. (CRM 2013).

Copy the MSI into the Folder 5. ERROR_INSTALL_TRANSFORM_FAILURE1624There was an error applying transforms. GetLastError: [2]. 2306: Could not create thread for patch application. This Installation Is Forbidden By System Policy. Contact Your System Administrator. Customer Center for Microsoft Dynamics CRM 2013 Customer Center for Microsoft Dynamics CRM 2011 Technical Support FAQ: Online Technical Support FAQ: On-Premise Billing FAQ Implementation Guide Developer Center and SDK Industries

Invalid info: [... 2742: Marshaling to Server failed: [2]. 2743: "Could not execute custom action [2], location: [3], command: [4]." 2744: "EXE failed called by custom action [2], location: [3], command: Cybermancer View Public Profile Find all posts by Cybermancer (#3) RKOver Banned Videocard: Sapphire 5870 @ 900MHz Processor: 920 D0 @ 4GHz HT on Mainboard: ASUS Rampage II Extreme Ive moved it back to where it was but, i dont think it is finding it so it might be time for a re-install. (You must log in or sign check over here Available beginning with Windows Installer version 3.0.

p.s.: It's usually the same with games bought from Steam, for example. Do i have to unpack them or something? Right-click on my computer and choose properties. 2. Reply Kamakshi Parate My Badges Suggested Answer Kamakshi Parate responded on 14 Feb 2015 11:59 AM Hello Ken, May I know the version of your CRM server?

ERROR_INSTALL_FAILURE1603A fatal error occurred during installation. Verify th... 1915: Error removing ODBC driver manager, ODBC error [2]: [3]. ERROR_INSTALL_TRANSFORM_REJECTED1644One or more customizations are not permitted by system policy. Available beginning with Windows Installer version 4.0.

Tags: error 1642 sccm 2012 r2 Thread Status: Not open for further replies. Click Environmental Variables. 5. I finally started reading blogs and found this one. Merge: There were merge conflicts reported in [3] tabl... 2269: Database: [2].

Google still targets this site under Crysis 1.2 problem and similar syntax. Table:... 2256: Database: [2] GenerateTransform/Merge: Number of primary keys in base... 2257: Database: [2]. If your outlook is of 32bits, it will not allow you update the outlook client. ERROR_PATCH_PACKAGE_REJECTED1643The patch package is not permitted by system policy.

Saving the download to a new file fixed it.