How To Fix Windows Installer Exited With Error 1625 Tutorial

Home > Windows Installer > Windows Installer Exited With Error 1625

Windows Installer Exited With Error 1625

Contents

Anybody have a clue what sort of setting is causing this? ERROR_UNKNOWN_COMPONENT1607The component identifier is not registered. ERROR_INSTALL_PLATFORM_UNSUPPORTED 1634 Component not used on this machine ERROR_INSTALL_NOTUSED 1635 This patch package could not be opened. ERROR_INSTALL_TEMP_UNWRITABLE 1633 This installation package is not supported on this platform. his comment is here

Contact your system administrator. How can I check the details of my Ubuntu installation? ERROR_PATCH_PACKAGE_OPEN_FAILED 1636 This patch package could not be opened. What commercial flight route requires the most (minimum possible) stops/layovers from A to B?

Msi Error Code 1603

Failed to save table [3]. 2278: Database: [2]. MsiExec.exe and InstMsi.exe Error Messages These error codes are returned by the Windows Installer functions MsiExec.exe and InstMsi.exe. This content is currently hidden from public view. Reason: Member has been banned from the site For more information, visit our FAQ's.

Cursor in invalid state. 2210: Database: [2]. No path exists for entry [2] in Directory t... 2707: Target paths not created. The asse... 1937: An error occurred during the installation of assembly '[6]'. Windows Installer Error 1619 If a reviewer makes significant contributions to improving a paper, may he/she suggest becoming a coauthor?

Verify that you have suffic... 1923: Service '[2]' ([3]) could not be installed. Double-click Prohibit non-administrators from applying vendor signed updates. GetLastError: [2]. 2307: Source file key name is null. 2308: Destination file name is null. 2309: Attempting to patch file [2] when patch already in progress. 2310: Attempting to continue patch Related Links LUA Buglight Troubleshooting the Windows Installer (SlideShare) Fix For App-V .NET Applications Broken By Recent Security Updates How to run Process Monitor (ProcMon) inside the App-V virtual environment How

Databases are the same. Windows Installer Returned 1613 Vmware You must install a Windows service pack that contains a newer version of the Windows Installer service. Tha... 1601: The Windows Installer Service Could Not Be Accessed 1601: The Windows Installer service could not be accessed. System error [3]. 1402: Could not open key: [2].

Windows Installer Error Codes

Search words: Parallels Tools Parallels Tools 1625 'Installer exited with error code 1625 PD 1e5db16426987d561060acdf56d947b4 48e7cf384e3b46432e32e6040476f122 33c4522b6fa9ca8e050f19b889fb58f1 Email subscription for changes to this article RSS subscription for changes to this article Sign up today to participate, stay informed, earn points and establish a reputation for yourself! Msi Error Code 1603 ERROR_INSTALL_SERVICE_FAILURE 1602 User cancelled installation. Msi Motherboard Error Codes ERROR_INSTALL_TRANSFORM_FAILURE1624There was an error applying transforms.

Click Disabled, and then click OK.  SLN12242 Last modified 12:36 pm PST January 20, 2016 turbotax faq, error, installation Was this helpful? http://speciii.com/windows-installer/windows-installer-error-code-1603-installing-windows-installer.html called out of sequence. 2903: The file [2] is missing. 2904: Could not BindImage file [2]. 2905: Could not read record from script file [2]. 2906: Missing header in script file Catalyst execution finished: 03/27/2008 19:30:08. System error [3]. 1405: Could not read value [2] from key [3]. Msi Error Codes

Downloads and tools Windows 10 dev tools Visual Studio Windows SDK Windows Store badges Essentials API reference (Windows apps) API reference (desktop apps) Code samples How-to guides (Windows apps) Learning resources Available beginning with Windows Installer version 3.0. Invalid or missing query string: [3]. 2238: Database: [2]. weblink ERROR_INDEX_ABSENT1611The component qualifier not present.

The sign... 1938: An error occurred during the installation of assembly '[6]'. This Installation Is Forbidden By System Policy. Contact Your System Administrator. GetLastError() returned: [2]. 2895: Freeing RICHED20.DLL failed. Verify that you... 1918: Error installing ODBC driver: [4], ODBC error [2]: [3].

ERROR_INSTALL_UI_FAILURE1621There was an error starting the Windows Installer service user interface.

Training and Tutorials Learn how to master Tableau's products with our on-demand, live or class room training. A DLL require... 1724: Removal completed successfully. 1725: Removal failed. 1726: Advertisement completed successfully. 1727: Advertisement failed. 1728: Configuration completed successfully. 1729: Configuration failed. 1730: You must be an Administrator to ERROR_UNKNOWN_PROPERTY1608This is an unknown property. Windows Installer Returned 1639 This message is indicative of a success.

Any Good Papers On Use of Virtual Machines? No primary columns defined for table creation. 2244: Database: [2]. GetLastError: [2]. 2333: Error setting file attributes. check over here Contact the application vendor to verify that this is a valid Windows Installer package.

All-Star 15483 Points 6040 Posts Re: VS2008 installation/setup failed with Return code: 1625 Mar 28, 2008 03:48 PM|Mikhail Arkhipov (MSFT)|LINK The installation of C:\MSOCache\All Users\{90120000-0115-0409-0000-0000000FF1CE}-C\OfficeMUI.msi is not permitted due to an Invalid Installer database format. 2220: Database: [2]. If ERROR_SUCCESS_REBOOT_REQUIRED is returned, the installation completed successfully but a reboot is required to complete the installation operation.   Note  If you are a user experiencing difficulty with your computer either during Invalid info: [... 2742: Marshaling to Server failed: [2]. 2743: "Could not execute custom action [2], location: [3], command: [4]." 2744: "EXE failed called by custom action [2], location: [3], command:

It also causes the VS2008 installer to fail at the “Microsoft Visual Studio Web Authoring Component”. System error: [3]. 2263: Could not open stream [2]. Verify that the specified transform paths are valid. Data access failed, out of memory. 2203: Database: [2].

ERROR_PATCH_TARGET_NOT_FOUND 1643 The patch package is not permitted by system policy. System error [3]. 1410: Could not increase the available registry space. [2] KB of free regis... 1500: Another installation is in progress. I... 1308: Source file not found: [2] 1309: Error attempting to open the source file: [3]. ERROR_APPHELP_BLOCK1259If Windows Installer determines a product may be incompatible with the current operating system, it displays a dialog box informing the user and asking whether to try to install anyway.

Global mutex not properly initialized. 2762: Cannot write script record. No path exists for entry [2] in Directory t... 2708: No entries found in the file table. 2709: The specified Component name ('[2]') not found in Component table. 2710: The requested ERROR_INSTALL_SERVICE_FAILURE1601The Windows Installer service could not be accessed. Transform: Cannot transform a temporary table.

Double click Enforcement 6. Privacy Statement| Terms of Use| Contact Us| Advertise With Us| CMS by Umbraco| Hosted on Microsoft Azure Feedback on ASP.NET| File Bugs| Support Lifecycle Symantec Connect Endpoint Management > Articles Entire